Build:
  1. 0
2026-09-20 02:01.05: New job: build vhdlib.0.9.1 (ff8a8e284328)
2026-09-20 02:01.05: Waiting for resource in pool day11-builds
2026-09-20 03:18.20: Got resource from pool day11-builds
2026-09-20 03:18.20: [profile full] build vhdlib.0.9.1
2026-09-20 03:18.20: build vhdlib.0.9.1 (ff8a8e284328)
=== DEPENDENCIES (31 transitive) ===
  base-bytes.base                                    ee0ab1feb01e
  base-threads.base                                  ddcab511c589
  base-unix.base                                     742554e1dbc2
  base64.3.5.2                                       13d57f87311d
  cmdliner.2.1.1                                     4a98b1b75fe6
  cppo.1.8.0                                         4ddf3928c99f
  csexp.1.5.2                                        0b0af13836ad
  dune.3.24.2                                        257948466020
  dune-configurator.3.24.2                           bc789a5d6376
  lwt.6.1.2                                          a9d89e5d232b
  ocaml.5.3.0                                        55734ab946ce
  ocaml-base-compiler.5.3.0                          82e869b248a7
  ocaml-compiler.5.3.0                               da258b07979d
  ocaml-compiler-libs.v0.17.0                        e102d6248307
  ocaml-config.3                                     8839a7892a4d
  ocamlbuild.0.16.1                                  8c613d0fe7e9
  ocamlfind.1.9.8                                    0cf2f5e2b174
  ocplib-endian.1.2                                  0abddcf142e7
  ppx_derivers.1.2.1                                 32a69341acfd
  ppx_deriving_rpc.9.0.0                             9ee8d98e0870
  ppxlib.0.35.0                                      8e0a3d070ded
  result.1.5                                         4596a9536a6c
  rpc.9.0.0                                          b4fcbba94767
  rpclib.9.0.0                                       666d40ea35ad
  rpclib-lwt.9.0.0                                   da6a318b0f7f
  rresult.0.7.0                                      94859b5ac92e
  sexplib0.v0.17.0                                   666aea651c23
  stdlib-shims.0.3.0                                 335533c08cc7
  topkg.1.1.1                                        db641ac9eb8a
  xmlm.1.4.0                                         6c33e29651d3
  yojson.3.0.0                                       d888d84c4245
=== STDOUT ===
Processing: [default: loading data]

The following system packages will first need to be installed:
    uuid-dev

<><> Handling external dependencies <><><><><><><><><><><><><><><><><><><><><><>

[WARNING] These additional system packages are required, but not available on your system: blktap-dev
+ /usr/bin/sudo "apt-get" "install" "-qq" "-yy" "uuid-dev"
- Selecting previously unselected package uuid-dev:amd64.
- (Reading database ... 
(Reading database ... 5%
(Reading database ... 10%
(Reading database ... 15%
(Reading database ... 20%
(Reading database ... 25%
(Reading database ... 30%
(Reading database ... 35%
(Reading database ... 40%
(Reading database ... 45%
(Reading database ... 50%
(Reading database ... 55%
(Reading database ... 60%
(Reading database ... 65%
(Reading database ... 70%
(Reading database ... 75%
(Reading database ... 80%
(Reading database ... 85%
(Reading database ... 90%
(Reading database ... 95%
(Reading database ... 100%
(Reading database ... 20108 files and directories currently installed.)
- Preparing to unpack .../uuid-dev_2.41-5_amd64.deb ...
- Unpacking uuid-dev:amd64 (2.41-5) ...
- Setting up uuid-dev:amd64 (2.41-5) ...
[vhdlib.0.9.1: dl]
[vhdlib.0.9.1: extract]
-> retrieved vhdlib.0.9.1  (https://opam.ocaml.org/cache)
[vhdlib: make]
+ /usr/bin/make  (CWD=/home/opam/.opam/default/.opam-switch/build/vhdlib.0.9.1)
- ocaml setup.ml -configure 
- File "./setup.ml", line 213, characters 8-26:
- 213 |         buf.[i] <- f s.[i]
-               ^^^^^^^^^^^^^^^^^^
- Error: Syntax error: strings are immutable, there is no assignment syntax for them.
- Hint: Mutable sequences of bytes are available in the Bytes module.
- Hint: Did you mean to use "Bytes.set"?
- make: *** [Makefile:32: setup.data] Error 2
[ERROR] The compilation of vhdlib.0.9.1 failed at "make".
build failed... 

=== STDERR ===

2026-09-20 03:18.36: FAILED: build vhdlib.0.9.1
2026-09-20 03:18.36: Job failed: build failed: vhdlib.0.9.1