Build:
- 0
2026-09-20 01:18.28: New job: build kinetic-client.0.0.9 (be083080a155)
2026-09-20 01:18.28: Waiting for resource in pool day11-builds
2026-09-20 02:38.15: Got resource from pool day11-builds
2026-09-20 02:38.15: [profile full] build kinetic-client.0.0.9
2026-09-20 02:38.15: build kinetic-client.0.0.9 (be083080a155)
=== DEPENDENCIES (42 transitive) ===
base-bytes.base ee5efbade6e4
base-threads.base ddcab511c589
base-unix.base 742554e1dbc2
base64.3.5.2 c99057ca2c8d
cmdliner.1.3.0 239cf14ab2a9
conf-gmp.5 00570d20295f
conf-gmp-powm-sec.4 0b0606327e14
conf-libssl.4 8f666ff3657c
conf-pkg-config.5 5bc8297bba82
conf-which.1 5fccb3a41099
conf-zlib.1 87393a303e89
cppo.1.8.0 1ad8193c77b2
cryptokit.1.21.1 f54d7e795075
csexp.1.5.2 f3f13927fb9a
dune.3.24.2 ea2bcb45ca29
dune-configurator.3.24.2 01cbc2b77bf8
easy-format.1.3.4 d0f42536bd8d
gen.1.1 3b8ed56061b5
lwt.5.10.1 242174d70869
lwt_log.1.1.2 1e31c9e6c6f2
lwt_ssl.1.2.0 8ca2e8982a39
ocaml.4.14.4 0eceb429ac11
ocaml-base-compiler.4.14.4 4a21df12bcb6
ocaml-compiler-libs.v0.12.4 35eb4dc2f91b
ocaml-config.2 58cec4e89336
ocamlbuild.0.16.1 4135d20a244c
ocamlfind.1.9.8 7bca84f6ccc0
ocplib-endian.1.2 5171b2fe2631
piqi.0.7.8 6ee6e04e7a47
piqilib.0.6.16 52f94e6875f6
ppx_derivers.1.2.1 c7bcacc2160f
ppx_deriving.6.0.3 a4eb1f7b2990
ppxlib.0.35.0 913045662d46
sedlex.2.6 db048721bca2
seq.base 5c9e32a94f22
sexplib0.v0.17.0 0b07fee7608f
ssl.0.7.0 b661a17d2304
stdlib-shims.0.3.0 f92f058899fa
topkg.1.1.1 31619c70d561
uchar.0.0.2 7d8f4e848531
xmlm.1.4.0 2fc0dc9139b4
zarith.1.14 14fa3444722a
=== STDOUT ===
Processing: [default: loading data]
The following system packages will first need to be installed:
protobuf-compiler
<><> Handling external dependencies <><><><><><><><><><><><><><><><><><><><><><>
+ /usr/bin/sudo "apt-get" "install" "-qq" "-yy" "protobuf-compiler"
- Selecting previously unselected package zlib1g-dev:amd64.
- (Reading database ...
(Reading database ... 5%
(Reading database ... 10%
(Reading database ... 15%
(Reading database ... 20%
(Reading database ... 25%
(Reading database ... 30%
(Reading database ... 35%
(Reading database ... 40%
(Reading database ... 45%
(Reading database ... 50%
(Reading database ... 55%
(Reading database ... 60%
(Reading database ... 65%
(Reading database ... 70%
(Reading database ... 75%
(Reading database ... 80%
(Reading database ... 85%
(Reading database ... 90%
(Reading database ... 95%
(Reading database ... 100%
(Reading database ... 20131 files and directories currently installed.)
- Preparing to unpack .../0-zlib1g-dev_1%3a1.3.dfsg+really1.3.1-1+b1_amd64.deb ...
- Unpacking zlib1g-dev:amd64 (1:1.3.dfsg+really1.3.1-1+b1) ...
- Selecting previously unselected package libprotobuf32t64:amd64.
- Preparing to unpack .../1-libprotobuf32t64_3.21.12-11+deb13u1_amd64.deb ...
- Unpacking libprotobuf32t64:amd64 (3.21.12-11+deb13u1) ...
- Selecting previously unselected package libprotobuf-lite32t64:amd64.
- Preparing to unpack .../2-libprotobuf-lite32t64_3.21.12-11+deb13u1_amd64.deb ...
- Unpacking libprotobuf-lite32t64:amd64 (3.21.12-11+deb13u1) ...
- Selecting previously unselected package libprotobuf-dev:amd64.
- Preparing to unpack .../3-libprotobuf-dev_3.21.12-11+deb13u1_amd64.deb ...
- Unpacking libprotobuf-dev:amd64 (3.21.12-11+deb13u1) ...
- Selecting previously unselected package libprotoc32t64:amd64.
- Preparing to unpack .../4-libprotoc32t64_3.21.12-11+deb13u1_amd64.deb ...
- Unpacking libprotoc32t64:amd64 (3.21.12-11+deb13u1) ...
- Selecting previously unselected package protobuf-compiler.
- Preparing to unpack .../5-protobuf-compiler_3.21.12-11+deb13u1_amd64.deb ...
- Unpacking protobuf-compiler (3.21.12-11+deb13u1) ...
- Setting up libprotobuf-lite32t64:amd64 (3.21.12-11+deb13u1) ...
- Setting up libprotobuf32t64:amd64 (3.21.12-11+deb13u1) ...
- Setting up zlib1g-dev:amd64 (1:1.3.dfsg+really1.3.1-1+b1) ...
- Setting up libprotoc32t64:amd64 (3.21.12-11+deb13u1) ...
- Setting up protobuf-compiler (3.21.12-11+deb13u1) ...
- Setting up libprotobuf-dev:amd64 (3.21.12-11+deb13u1) ...
- Processing triggers for libc-bin (2.41-12+deb13u3) ...
[kinetic-client.0.0.9: dl]
[kinetic-client.0.0.9: extract]
-> retrieved kinetic-client.0.0.9 (https://opam.ocaml.org/cache)
[kinetic-client: make]
+ /usr/bin/make (CWD=/home/opam/.opam/default/.opam-switch/build/kinetic-client.0.0.9)
- piqi of-proto src/kinetic.proto -o src/kinetic.proto.piqi
- piqic-ocaml --embed-piqi -C src src/kinetic.proto.piqi
- ocamlbuild -use-ocamlfind test_it.native
- + ocamlfind ocamlc -config
- + ocamlfind ocamldep -package ppx_deriving.std -package cmdliner -package cryptokit -package lwt.unix -package lwt_log -package lwt_ssl -package lwt -modules examples/test_it.ml > examples/test_it.ml.depends
- + ocamlfind ocamldep -package ppx_deriving.std -package cmdliner -package cryptokit -package lwt.unix -package lwt_log -package lwt_ssl -package lwt -modules src/kinetic.mli > src/kinetic.mli.depends
- + ocamlfind ocamldep -package ppx_deriving.std -package cmdliner -package cryptokit -package lwt.unix -package lwt_log -package lwt_ssl -package lwt -modules src/kinetic_util.ml > src/kinetic_util.ml.depends
- + ocamlfind ocamlc -c -g -annot -thread -package ppx_deriving.std -package cmdliner -package cryptokit -package lwt.unix -package lwt_log -package lwt_ssl -package lwt -I src -I examples -o src/kinetic.cmi src/kinetic.mli
- + ocamlfind ocamlc -c -g -annot -thread -package ppx_deriving.std -package cmdliner -package cryptokit -package lwt.unix -package lwt_log -package lwt_ssl -package lwt -I src -I examples -o src/kinetic_util.cmo src/kinetic_util.ml
- + ocamlfind ocamlc -c -g -annot -thread -package ppx_deriving.std -package cmdliner -package cryptokit -package lwt.unix -package lwt_log -package lwt_ssl -package lwt -I examples -I src -o examples/test_it.cmo examples/test_it.ml
- + ocamlfind ocamlc -c -g -annot -thread -package ppx_deriving.std -package cmdliner -package cryptokit -package lwt.unix -package lwt_log -package lwt_ssl -package lwt -I examples -I src -o examples/test_it.cmo examples/test_it.ml
- File "examples/test_it.ml", line 54, characters 15-32:
- 54 | K.get client "I do not exist?" >>=? fun vo ->
- ^^^^^^^^^^^^^^^^^
- Error: This expression has type string but an expression was expected of type
- Kinetic.key = bytes
- Command exited with code 2.
- make: *** [Makefile:13: example] Error 10
[ERROR] The compilation of kinetic-client.0.0.9 failed at "make".
build failed...
=== STDERR ===
2026-09-20 02:38.58: FAILED: build kinetic-client.0.0.9
2026-09-20 02:38.58: Job failed: build failed: kinetic-client.0.0.9