Build:
  1. 0
2026-09-20 00:12.18: New job: build raygui.1.3.0 (4e69956856a9)
2026-09-20 00:12.18: Waiting for resource in pool day11-builds
2026-09-20 01:38.51: Got resource from pool day11-builds
2026-09-20 01:38.51: [profile full] build raygui.1.3.0
2026-09-20 01:38.51: build raygui.1.3.0 (4e69956856a9)
=== DEPENDENCIES (20 transitive) ===
  base-threads.base                                  ddcab511c589
  base-unix.base                                     742554e1dbc2
  compiler-cloning.enabled                           9ab6e8146b48
  conf-libxcursor.1                                  36fde841dfda
  conf-libxi.1                                       0afcacd8cb23
  conf-libxinerama.1                                 e635df19cf4b
  conf-libxrandr.1                                   f5d4177641c6
  conf-mesa.1                                        93c7dce83545
  conf-pkg-config.5                                  5bc8297bba82
  csexp.1.5.2                                        6dfd0b7165bf
  ctypes.0.24.0                                      1ee81f3475f3
  dune.3.24.2                                        fc1180f13f25
  dune-configurator.3.24.2                           85add40e4d98
  integers.0.8.0                                     59cb553a1092
  ocaml.5.5.1                                        62cb7e73ffb1
  ocaml-base-compiler.5.5.1                          3187d6d6f452
  ocaml-compiler.5.5.1                               3af2e5d33cd9
  patch.2.0.0                                        2410a65b9b10
  raylib.1.3.1                                       5ca07a6e72a3
  stdlib-shims.0.3.0                                 1941f34b811d
=== STDOUT ===
Processing: [default: loading data]
[raygui.1.3.0: dl]
[raygui.1.3.0: extract]
-> retrieved raygui.1.3.0  (https://opam.ocaml.org/cache)
[raygui: dune build]
+ /home/opam/.opam/default/bin/dune "build" "-p" "raygui" "-j" "39" "@install" (CWD=/home/opam/.opam/default/.opam-switch/build/raygui.1.3.0)
- File "src/c/dune", line 180, characters 9-24:
- 180 |   (names c_generated_gui)
-                ^^^^^^^^^^^^^^^
- (cd _build/default/src/c && /usr/bin/gcc -O2 -fno-strict-aliasing -fwrapv -fPIC -pthread -D_FILE_OFFSET_BITS=64 -O2 -fno-strict-aliasing -fwrapv -fPIC -pthread -g -I /home/opam/.opam/default/lib/ocaml -I /home/opam/.opam/default/lib/ctypes -I /home/opam/.opam/default/lib/ctypes/stubs -I /home/opam/.opam/default/lib/integers -I /home/opam/.opam/default/lib/ocaml/str -I /home/opam/.opam/default/lib/raylib/__private__/raylib_fixed_types -I /home/opam/.opam/default/lib/raylib/__private__/raylib_types -I /home/opam/.opam/default/lib/stdlib-shims -I functions -I types -I vendor/raygui/src -I vendor/raylib/src -o c_generated_gui.o -c c_generated_gui.c)
- c_generated_gui.c: In function 'raygui_stub_37_GuiListViewEx':
- c_generated_gui.c:378:35: error: passing argument 2 of 'GuiListViewEx' from incompatible pointer type [-Wincompatible-pointer-types]
-   378 |    int x405 = GuiListViewEx(x395, x396, x397, x400, x401, x402);
-       |                                   ^~~~
-       |                                   |
-       |                                   const char **
- In file included from c_generated_gui.c:3:
- vendor/raygui/src/raygui.h:2724:44: note: expected 'char **' but argument is of type 'const char **'
-  2724 | int GuiListViewEx(Rectangle bounds, char **text, int count, int *focus, int *scrollIndex, int active)
-       |                                     ~~~~~~~^~~~
[ERROR] The compilation of raygui.1.3.0 failed at "dune build -p raygui -j 39 @install".
build failed... 

=== STDERR ===

2026-09-20 01:39.30: FAILED: build raygui.1.3.0
2026-09-20 01:39.30: Job failed: build failed: raygui.1.3.0