Build:
  1. 0
2026-09-20 00:07.05: New job: build mpg123.0.1 (899c9ac2c81e)
2026-09-20 00:07.05: Waiting for resource in pool day11-builds
2026-09-20 01:38.11: Got resource from pool day11-builds
2026-09-20 01:38.11: [profile full] build mpg123.0.1
2026-09-20 01:38.11: build mpg123.0.1 (899c9ac2c81e)
=== DEPENDENCIES (16 transitive) ===
  base-threads.base                                  ddcab511c589
  base-unix.base                                     742554e1dbc2
  compiler-cloning.enabled                           9ab6e8146b48
  conf-libffi.2.0.0                                  2de1e6fba1f5
  conf-libmpg123.1                                   b69466a2be67
  conf-pkg-config.5                                  5bc8297bba82
  csexp.1.5.2                                        6dfd0b7165bf
  ctypes.0.24.0                                      1ee81f3475f3
  ctypes-foreign.0.24.0                              c149ba69f1b0
  dune.3.24.2                                        fc1180f13f25
  dune-configurator.3.24.2                           85add40e4d98
  integers.0.8.0                                     59cb553a1092
  ocaml.5.5.1                                        62cb7e73ffb1
  ocaml-base-compiler.5.5.1                          3187d6d6f452
  ocaml-compiler.5.5.1                               3af2e5d33cd9
  stdlib-shims.0.3.0                                 1941f34b811d
=== STDOUT ===
Processing: [default: loading data]
[mpg123.0.1: dl]
[mpg123.0.1: extract]
-> retrieved mpg123.0.1  (https://opam.ocaml.org/cache)
[mpg123: dune build]
+ /home/opam/.opam/default/bin/dune "build" "-p" "mpg123" "-j" "39" "@install" (CWD=/home/opam/.opam/default/.opam-switch/build/mpg123.0.1)
- File "c/dune", line 66, characters 11-32:
- 66 |     (names c_generated_functions)
-                 ^^^^^^^^^^^^^^^^^^^^^
- (cd _build/default/c && /usr/bin/gcc -O2 -fno-strict-aliasing -fwrapv -fPIC -pthread -D_FILE_OFFSET_BITS=64 -I/usr/include/x86_64-linux-gnu -g -I /home/opam/.opam/default/lib/ocaml -I /home/opam/.opam/default/lib/ctypes -I /home/opam/.opam/default/lib/integers -I /home/opam/.opam/default/lib/stdlib-shims -I . -o c_generated_functions.o -c c_generated_functions.c)
- c_generated_functions.c: In function 'mpg123_stub_8_mpg123_decoders':
- c_generated_functions.c:77:17: error: initialization of 'char **' from incompatible pointer type 'const char **' [-Wincompatible-pointer-types]
-    77 |    char** x46 = mpg123_decoders();
-       |                 ^~~~~~~~~~~~~~~
- c_generated_functions.c: In function 'mpg123_stub_9_mpg123_supported_decoders':
- c_generated_functions.c:86:17: error: initialization of 'char **' from incompatible pointer type 'const char **' [-Wincompatible-pointer-types]
-    86 |    char** x51 = mpg123_supported_decoders();
-       |                 ^~~~~~~~~~~~~~~~~~~~~~~~~
- c_generated_functions.c: In function 'mpg123_stub_14_mpg123_read':
- c_generated_functions.c:141:41: error: passing argument 4 of 'mpg123_read' from incompatible pointer type [-Wincompatible-pointer-types]
-   141 |    int x93 = mpg123_read(x87, x88, x89, x92);
-       |                                         ^~~
-       |                                         |
-       |                                         int *
- In file included from c_generated_functions.c:1:
- /usr/include/x86_64-linux-gnu/mpg123.h:828:53: note: expected 'size_t *' {aka 'long unsigned int *'} but argument is of type 'int *'
-   828 | ,       void *outmemory, size_t outmemsize, size_t *done );
-       |                                             ~~~~~~~~^~~~
- c_generated_functions.c: In function 'mpg123_stub_20_mpg123_getformat':
- c_generated_functions.c:207:38: error: passing argument 2 of 'mpg123_getformat' from incompatible pointer type [-Wincompatible-pointer-types]
-   207 |    int x139 = mpg123_getformat(x135, x136, x137, x138);
-       |                                      ^~~~
-       |                                      |
-       |                                      int *
- /usr/include/x86_64-linux-gnu/mpg123.h:692:15: note: expected 'long int *' but argument is of type 'int *'
-   692 | ,       long *rate, int *channels, int *encoding );
-       |         ~~~~~~^~~~
[ERROR] The compilation of mpg123.0.1 failed at "dune build -p mpg123 -j 39 @install".
build failed... 

=== STDERR ===

2026-09-20 01:38.22: FAILED: build mpg123.0.1
2026-09-20 01:38.22: Job failed: build failed: mpg123.0.1