Build:
  1. 0
2026-09-20 00:07.05: New job: build orocksdb.0.2.2 (85cba53a1fb2)
2026-09-20 00:07.05: Waiting for resource in pool day11-builds
2026-09-20 01:37.59: Got resource from pool day11-builds
2026-09-20 01:37.59: [profile full] build orocksdb.0.2.2
2026-09-20 01:37.59: build orocksdb.0.2.2 (85cba53a1fb2)
=== DEPENDENCIES (18 transitive) ===
  base-threads.base                                  ddcab511c589
  base-unix.base                                     742554e1dbc2
  compiler-cloning.enabled                           9ab6e8146b48
  conf-libffi.2.0.0                                  2de1e6fba1f5
  conf-pkg-config.5                                  5bc8297bba82
  conf-rocksdb.2                                     f20bda0ef6c1
  csexp.1.5.2                                        6dfd0b7165bf
  ctypes.0.24.0                                      1ee81f3475f3
  ctypes-foreign.0.24.0                              c149ba69f1b0
  dune.3.24.2                                        fc1180f13f25
  dune-configurator.3.24.2                           85add40e4d98
  integers.0.8.0                                     59cb553a1092
  ocaml.5.5.1                                        62cb7e73ffb1
  ocaml-base-compiler.5.5.1                          3187d6d6f452
  ocaml-compiler.5.5.1                               3af2e5d33cd9
  ocamlbuild.0.16.1                                  8d3df99eafcd
  ocamlfind.1.9.9~preview                            7593ab790e0d
  stdlib-shims.0.3.0                                 1941f34b811d
=== STDOUT ===
Processing: [default: loading data]
[orocksdb.0.2.2: dl]
[orocksdb.0.2.2: extract]
-> retrieved orocksdb.0.2.2  (https://opam.ocaml.org/cache)
[orocksdb: make]
+ /usr/bin/make  (CWD=/home/opam/.opam/default/.opam-switch/build/orocksdb.0.2.2)
- ocamlbuild -use-ocamlfind -lflags -cclib,/usr/local/lib/librocksdb.so rocks.inferred.mli rocks.cma rocks.cmxa rocks.cmxs rocks_options.inferred.mli
- + ocamlfind ocamlc -config
- + ocamlfind ocamldep -package ctypes.foreign -package ctypes -modules rocks.ml > rocks.ml.depends
- + ocamlfind ocamldep -package ctypes.foreign -package ctypes -modules rocks_common.ml > rocks_common.ml.depends
- + ocamlfind ocamldep -package ctypes.foreign -package ctypes -modules rocks_options.ml > rocks_options.ml.depends
- + ocamlfind ocamlc -c -g -annot -package ctypes.foreign -package ctypes -o rocks_common.cmo rocks_common.ml
- + ocamlfind ocamlc -c -g -annot -package ctypes.foreign -package ctypes -o rocks_options.cmo rocks_options.ml
- + ocamlfind ocamlc -i -package ctypes.foreign -package ctypes rocks.ml > rocks.inferred.mli
- + ocamlfind ocamlc -i -package ctypes.foreign -package ctypes rocks.ml > rocks.inferred.mli
- File "rocks.ml", line 172, characters 19-34:
- 172 |         let res' = string_from_ptr res (!@ res_size) in
-                          ^^^^^^^^^^^^^^^
- Warning 6 [labels-omitted]: label length was omitted in the application of
-   this function.
- 
- File "rocks.ml", line 277, characters 9-24:
- 277 |     else string_from_ptr res (!@ res_size)
-                ^^^^^^^^^^^^^^^
- Warning 6 [labels-omitted]: label length was omitted in the application of
-   this function.
- 
- File "rocks.ml", line 296, characters 9-24:
- 296 |     else string_from_ptr res (!@ res_size)
-                ^^^^^^^^^^^^^^^
- Warning 6 [labels-omitted]: label length was omitted in the application of
-   this function.
- + ocamlfind ocamldep -package ctypes.foreign -package ctypes -modules rocks.mli > rocks.mli.depends
- + ocamlfind ocamlc -c -g -annot -package ctypes.foreign -package ctypes -o rocks.cmi rocks.mli
- + ocamlfind ocamlc -c -g -annot -package ctypes.foreign -package ctypes -o rocks.cmo rocks.ml
- + ocamlfind ocamlc -c -g -annot -package ctypes.foreign -package ctypes -o rocks.cmo rocks.ml
- File "rocks.ml", line 172, characters 19-34:
- 172 |         let res' = string_from_ptr res (!@ res_size) in
-                          ^^^^^^^^^^^^^^^
- Warning 6 [labels-omitted]: label length was omitted in the application of
-   this function.
- 
- File "rocks.ml", line 277, characters 9-24:
- 277 |     else string_from_ptr res (!@ res_size)
-                ^^^^^^^^^^^^^^^
- Warning 6 [labels-omitted]: label length was omitted in the application of
-   this function.
- 
- File "rocks.ml", line 296, characters 9-24:
- 296 |     else string_from_ptr res (!@ res_size)
-                ^^^^^^^^^^^^^^^
- Warning 6 [labels-omitted]: label length was omitted in the application of
-   this function.
- + ocamlfind ocamlc -a -cclib /usr/local/lib/librocksdb.so -package ctypes.foreign -package ctypes rocks_common.cmo rocks_options.cmo rocks.cmo -o rocks.cma
- + ocamlfind ocamlopt -c -g -annot -package ctypes.foreign -package ctypes -o rocks_common.cmx rocks_common.ml
- + ocamlfind ocamlopt -c -g -annot -package ctypes.foreign -package ctypes -o rocks_options.cmx rocks_options.ml
- + ocamlfind ocamlopt -c -g -annot -package ctypes.foreign -package ctypes -o rocks.cmx rocks.ml
- + ocamlfind ocamlopt -c -g -annot -package ctypes.foreign -package ctypes -o rocks.cmx rocks.ml
- File "rocks.ml", line 172, characters 19-34:
- 172 |         let res' = string_from_ptr res (!@ res_size) in
-                          ^^^^^^^^^^^^^^^
- Warning 6 [labels-omitted]: label length was omitted in the application of
-   this function.
- 
- File "rocks.ml", line 277, characters 9-24:
- 277 |     else string_from_ptr res (!@ res_size)
-                ^^^^^^^^^^^^^^^
- Warning 6 [labels-omitted]: label length was omitted in the application of
-   this function.
- 
- File "rocks.ml", line 296, characters 9-24:
- 296 |     else string_from_ptr res (!@ res_size)
-                ^^^^^^^^^^^^^^^
- Warning 6 [labels-omitted]: label length was omitted in the application of
-   this function.
- + ocamlfind ocamlopt -a -cclib /usr/local/lib/librocksdb.so -package ctypes.foreign -package ctypes rocks_common.cmx rocks_options.cmx rocks.cmx -o rocks.cmxa
- + ocamlfind ocamlopt -shared -cclib /usr/local/lib/librocksdb.so -linkall -package ctypes.foreign -package ctypes rocks.cmxa -o rocks.cmxs
- + ocamlfind ocamlopt -shared -cclib /usr/local/lib/librocksdb.so -linkall -package ctypes.foreign -package ctypes rocks.cmxa -o rocks.cmxs
- /usr/bin/ld: cannot find /usr/local/lib/librocksdb.so: No such file or directory
- /usr/bin/ld: cannot find /usr/local/lib/librocksdb.so: No such file or directory
- collect2: error: ld returned 1 exit status
- File "caml_startup", line 1:
- Error: Error during linking (exit code 1)
- Command exited with code 2.
- make: *** [Makefile:7: build] Error 10
[ERROR] The compilation of orocksdb.0.2.2 failed at "make".
build failed... 

=== STDERR ===

2026-09-20 01:38.17: FAILED: build orocksdb.0.2.2
2026-09-20 01:38.17: Job failed: build failed: orocksdb.0.2.2