Build:
- 0
2026-09-20 00:07.05: New job: build llama-cpp-ocaml.0.0.1 (805dd21e7138)
2026-09-20 00:07.05: Waiting for resource in pool day11-builds
2026-09-20 01:38.11: Got resource from pool day11-builds
2026-09-20 01:38.11: [profile full] build llama-cpp-ocaml.0.0.1
2026-09-20 01:38.12: build llama-cpp-ocaml.0.0.1 (805dd21e7138)
=== DEPENDENCIES (16 transitive) ===
base-threads.base ddcab511c589
base-unix.base 742554e1dbc2
bigarray-compat.1.1.0 189caa214a75
compiler-cloning.enabled 9ab6e8146b48
conf-libffi.2.0.0 2de1e6fba1f5
conf-pkg-config.5 5bc8297bba82
csexp.1.5.2 6dfd0b7165bf
ctypes.0.24.0 1ee81f3475f3
ctypes-foreign.0.24.0 c149ba69f1b0
dune.3.24.2 fc1180f13f25
dune-configurator.3.24.2 85add40e4d98
integers.0.8.0 59cb553a1092
ocaml.5.5.1 62cb7e73ffb1
ocaml-base-compiler.5.5.1 3187d6d6f452
ocaml-compiler.5.5.1 3af2e5d33cd9
stdlib-shims.0.3.0 1941f34b811d
=== STDOUT ===
Processing: [default: loading data]
[llama-cpp-ocaml.0.0.1: dl]
[llama-cpp-ocaml.0.0.1: extract]
-> retrieved llama-cpp-ocaml.0.0.1 (https://opam.ocaml.org/cache)
[llama-cpp-ocaml: dune build]
+ /home/opam/.opam/default/bin/dune "build" "-p" "llama-cpp-ocaml" "-j" "39" "@install" (CWD=/home/opam/.opam/default/.opam-switch/build/llama-cpp-ocaml.0.0.1)
- (cd _build/default/src && /usr/bin/patch -d llama.cpp -p1) < _build/default/src/produce-static-archive.patch
- patching file Makefile
- File "src/dune", line 74, characters 10-31:
- 74 | (names c_generated_functions extra_stubs)
- ^^^^^^^^^^^^^^^^^^^^^
- (cd _build/default/src && /usr/bin/gcc -O2 -fno-strict-aliasing -fwrapv -fPIC -pthread -D_FILE_OFFSET_BITS=64 -O2 -fno-strict-aliasing -fwrapv -fPIC -pthread -g -I /home/opam/.opam/default/lib/ocaml -I /home/opam/.opam/default/lib/bigarray-compat -I /home/opam/.opam/default/lib/ctypes -I /home/opam/.opam/default/lib/ctypes-foreign -I /home/opam/.opam/default/lib/integers -I /home/opam/.opam/default/lib/ocaml/str -I functions -I types -I llama.cpp -o c_generated_functions.o -c c_generated_functions.c)
- c_generated_functions.c: In function 'llama_stub_39_llama_token_get_text':
- c_generated_functions.c:268:17: warning: initialization discards 'const' qualifier from pointer target type [-Wdiscarded-qualifiers]
- 268 | char* x198 = llama_token_get_text(x194, x195);
- | ^~~~~~~~~~~~~~~~~~~~
- c_generated_functions.c: In function 'llama_stub_49_llama_grammar_init':
- c_generated_functions.c:351:52: error: passing argument 1 of 'llama_grammar_init' from incompatible pointer type [-Wincompatible-pointer-types]
- 351 | struct llama_grammar* x288 = llama_grammar_init(x281, x282, x285);
- | ^~~~
- | |
- | llama_grammar_element **
- In file included from c_generated_functions.c:2:
- llama.cpp/llama.h:409:44: note: expected 'const llama_grammar_element **' but argument is of type 'llama_grammar_element **'
- 409 | const llama_grammar_element ** rules,
- | ~~~~~~~~~~~~~~~~~~~~~~~~~~~~~~~^~~~~
- c_generated_functions.c: In function 'llama_stub_71_llama_print_system_info':
- c_generated_functions.c:599:17: warning: initialization discards 'const' qualifier from pointer target type [-Wdiscarded-qualifiers]
- 599 | char* x518 = llama_print_system_info();
- | ^~~~~~~~~~~~~~~~~~~~~~~
- c_generated_functions.c: In function 'llama_stub_72_llama_log_set':
- c_generated_functions.c:607:18: error: passing argument 1 of 'llama_log_set' from incompatible pointer type [-Wincompatible-pointer-types]
- 607 | llama_log_set(x521, x522);
- | ^~~~
- | |
- | void (*)(enum llama_log_level, char *, void *)
- llama.cpp/llama.h:527:53: note: expected 'llama_log_callback' {aka 'void (*)(enum llama_log_level, const char *, void *)'} but argument is of type 'void (*)(enum llama_log_level, char *, void *)'
- 527 | LLAMA_API void llama_log_set(llama_log_callback log_callback, void * user_data);
- | ~~~~~~~~~~~~~~~~~~~^~~~~~~~~~~~
- (cd _build/default/src && /usr/bin/make -C llama.cpp libllama.so libllama.a)
- make: Entering directory '/home/opam/.opam/default/.opam-switch/build/llama-cpp-ocaml.0.0.1/_build/default/src/llama.cpp'
- I llama.cpp build info:
- I UNAME_S: Linux
- I UNAME_P: unknown
- I UNAME_M: x86_64
- I CFLAGS: -I. -Icommon -DNDEBUG -DGGML_USE_K_QUANTS -O3 -std=c11 -fPIC -D_XOPEN_SOURCE=600 -D_GNU_SOURCE -Wall -Wextra -Wpedantic -Wcast-qual -Wdouble-promotion -Wshadow -Wstrict-prototypes -Wpointer-arith -Wmissing-prototypes -Werror=implicit-int -Wno-unused-function -pthread -march=native -mtune=native
- I CXXFLAGS: -I. -Icommon -DNDEBUG -DGGML_USE_K_QUANTS -O3 -std=c++11 -fPIC -D_XOPEN_SOURCE=600 -D_GNU_SOURCE -Wall -Wextra -Wpedantic -Wcast-qual -Wno-unused-function -Wno-multichar -Wno-format-truncation -Wno-array-bounds -pthread -march=native -mtune=native
- I LDFLAGS:
- I CC: cc (Debian 14.2.0-19) 14.2.0
- I CXX: g++ (Debian 14.2.0-19) 14.2.0
-
- g++ -I. -Icommon -DNDEBUG -DGGML_USE_K_QUANTS -O3 -std=c++11 -fPIC -D_XOPEN_SOURCE=600 -D_GNU_SOURCE -Wall -Wextra -Wpedantic -Wcast-qual -Wno-unused-function -Wno-multichar -Wno-format-truncation -Wno-array-bounds -pthread -march=native -mtune=native -c llama.cpp -o llama.o
- cc -I. -Icommon -DNDEBUG -DGGML_USE_K_QUANTS -O3 -std=c11 -fPIC -D_XOPEN_SOURCE=600 -D_GNU_SOURCE -Wall -Wextra -Wpedantic -Wcast-qual -Wdouble-promotion -Wshadow -Wstrict-prototypes -Wpointer-arith -Wmissing-prototypes -Werror=implicit-int -Wno-unused-function -pthread -march=native -mtune=native -c ggml.c -o ggml.o
- cc -I. -Icommon -DNDEBUG -DGGML_USE_K_QUANTS -O3 -std=c11 -fPIC -D_XOPEN_SOURCE=600 -D_GNU_SOURCE -Wall -Wextra -Wpedantic -Wcast-qual -Wdouble-promotion -Wshadow -Wstrict-prototypes -Wpointer-arith -Wmissing-prototypes -Werror=implicit-int -Wno-unused-function -pthread -march=native -mtune=native -c k_quants.c -o k_quants.o
- cc -I. -Icommon -DNDEBUG -DGGML_USE_K_QUANTS -O3 -std=c11 -fPIC -D_XOPEN_SOURCE=600 -D_GNU_SOURCE -Wall -Wextra -Wpedantic -Wcast-qual -Wdouble-promotion -Wshadow -Wstrict-prototypes -Wpointer-arith -Wmissing-prototypes -Werror=implicit-int -Wno-unused-function -pthread -march=native -mtune=native -c ggml-alloc.c -o ggml-alloc.o
- g++ -I. -Icommon -DNDEBUG -DGGML_USE_K_QUANTS -O3 -std=c++11 -fPIC -D_XOPEN_SOURCE=600 -D_GNU_SOURCE -Wall -Wextra -Wpedantic -Wcast-qual -Wno-unused-function -Wno-multichar -Wno-format-truncation -Wno-array-bounds -pthread -march=native -mtune=native -shared -fPIC -o libllama.so llama.o ggml.o k_quants.o ggml-alloc.o
- ar -rc libllama.a llama.o ggml.o k_quants.o ggml-alloc.o
- make: Leaving directory '/home/opam/.opam/default/.opam-switch/build/llama-cpp-ocaml.0.0.1/_build/default/src/llama.cpp'
[ERROR] The compilation of llama-cpp-ocaml.0.0.1 failed at "dune build -p llama-cpp-ocaml -j 39 @install".
build failed...
=== STDERR ===
2026-09-20 01:38.51: FAILED: build llama-cpp-ocaml.0.0.1
2026-09-20 01:38.51: Job failed: build failed: llama-cpp-ocaml.0.0.1