Build:
  1. 0
2026-09-19 22:57.44: New job: build metapp.0.3.0 (e259a0eb3dc6)
2026-09-19 22:57.44: Waiting for resource in pool day11-builds
2026-09-20 00:43.07: Got resource from pool day11-builds
2026-09-20 00:43.07: [profile full] build metapp.0.3.0
2026-09-20 00:43.07: build metapp.0.3.0 (e259a0eb3dc6)
=== DEPENDENCIES (18 transitive) ===
  base-threads.base                                  ddcab511c589
  base-unix.base                                     742554e1dbc2
  conf-autoconf.1                                    43fe4a407b7a
  conf-automake.1                                    5b19634b4ea9
  dune.3.24.2                                        b27a09bf6f27
  ocaml.4.11.2                                       724562efb759
  ocaml-base-compiler.4.11.2                         c280e835148d
  ocaml-compiler-libs.v0.12.4                        b8cc10bd4147
  ocaml-config.1                                     f11ab3cebca9
  ocaml-migrate-parsetree.2.4.0                      a4cfc9223a0a
  ocaml-secondary-compiler.4.14.2                    e2a22285b593
  ocamlfind.1.9.6                                    45f86f2c0142
  ocamlfind-secondary.1.9.6                          fad26ecf706a
  ppx_derivers.1.2.1                                 191b8c002db2
  ppxlib.0.17.0                                      22c24c52a071
  sexplib0.v0.16.0                                   8e195b00192a
  stdcompat.18                                       af26a688384a
  stdlib-shims.0.3.0                                 10f620111cba
=== STDOUT ===
Processing: [default: loading data]
[metapp.0.3.0: dl]
[metapp.0.3.0: extract]
-> retrieved metapp.0.3.0  (https://opam.ocaml.org/cache)
[metapp: dune build]
+ /home/opam/.opam/default/bin/dune "build" "-p" "metapp" "-j" "39" "@install" (CWD=/home/opam/.opam/default/.opam-switch/build/metapp.0.3.0)
- File "metapp/dune", line 3, characters 14-30:
- 3 |   (preprocess (pps metapp.ppx))
-                   ^^^^^^^^^^^^^^^^
- (cd _build/default && .ppx/e17850eae66b6b5844e45f672bc501f8/ppx.exe --cookie 'library-name="metapp"' -o metapp/metapp.pp.mli --intf metapp/metapp.mli -corrected-suffix .ppx-corrected -diff-cmd - -dump-ast)
- findlib: [WARNING] Interface topdirs.cmi occurs in several directories: /home/opam/.opam/default/lib/ocaml, /home/opam/.opam/default/lib/ocaml/compiler-libs
- File "_none_", line 1:
- Warning 58: no cmx file was found in path for module Metapp_api, and its interface was not compiled with -opaque
- File "_none_", line 1:
- Error: error loading shared library: Dynlink.Error (Dynlink.Cannot_open_dll "Failure(\"/tmp/build_162962_dune/metapp164b38.cmxs: failed to map segment from shared object\")")
- File "metapp/dune", line 3, characters 14-30:
- 3 |   (preprocess (pps metapp.ppx))
-                   ^^^^^^^^^^^^^^^^
- (cd _build/default && .ppx/e17850eae66b6b5844e45f672bc501f8/ppx.exe --cookie 'library-name="metapp"' -o metapp/metapp.pp.ml --impl metapp/metapp.ml -corrected-suffix .ppx-corrected -diff-cmd - -dump-ast)
- findlib: [WARNING] Interface topdirs.cmi occurs in several directories: /home/opam/.opam/default/lib/ocaml, /home/opam/.opam/default/lib/ocaml/compiler-libs
- File "_none_", line 1:
- Warning 58: no cmx file was found in path for module Metapp_api, and its interface was not compiled with -opaque
- File "_none_", line 1:
- Warning 58: no cmx file was found in path for module Metapp_preutils, and its interface was not compiled with -opaque
- File "_none_", line 1:
- Error: error loading shared library: Dynlink.Error (Dynlink.Cannot_open_dll "Failure(\"/tmp/build_162962_dune/metappb87d71.cmxs: failed to map segment from shared object\")")
[ERROR] The compilation of metapp.0.3.0 failed at "dune build -p metapp -j 39 @install".
build failed... 

=== STDERR ===

2026-09-20 00:43.57: FAILED: build metapp.0.3.0
2026-09-20 00:43.57: Job failed: build failed: metapp.0.3.0