Build:
- 1
- 0
2026-09-19 22:52.53: New job: build clangml.3.7.0.2 (f493508959f6)
2026-09-19 22:52.53: Waiting for resource in pool day11-builds
2026-09-20 00:35.55: Got resource from pool day11-builds
2026-09-20 00:35.55: [profile full] build clangml.3.7.0.2
2026-09-20 00:35.55: build clangml.3.7.0.2 (f493508959f6)
=== DEPENDENCIES (19 transitive) ===
ANSITerminal.0.8.5 b9547cd5eb2f
base-bytes.base ee5efbade6e4
base-threads.base ddcab511c589
base-unix.base 742554e1dbc2
batteries.3.11.0 d3cc01243e0b
camlp-streams.5.0.1 c544ff4c9329
camlp4.4.14+1 4ba3fd00f0c0
deriving.0.8.1 e6ddf525d09d
dolog.3.0 27a7faba2944
dune.3.24.2 ea2bcb45ca29
num.1.6 9b8d17e98111
oasis.0.4.11 06b46fb33d60
ocaml.4.14.4 0eceb429ac11
ocaml-base-compiler.4.14.4 4a21df12bcb6
ocaml-config.2 58cec4e89336
ocamlbuild.0.16.1 4135d20a244c
ocamlfind.1.9.8 7bca84f6ccc0
ocamlify.0.0.1 f041ee48d22e
ocamlmod.0.1.1 4db033e26890
=== STDOUT ===
Processing: [default: loading data]
The following system packages will first need to be installed:
binutils-dev libboost-dev
<><> Handling external dependencies <><><><><><><><><><><><><><><><><><><><><><>
[WARNING] These additional system packages are required, but not available on your system: clang-3.7 libclang-3.7-dev llvm-3.7-dev
+ /usr/bin/sudo "apt-get" "install" "-qq" "-yy" "binutils-dev" "libboost-dev"
- Selecting previously unselected package binutils-dev.
- (Reading database ...
(Reading database ... 5%
(Reading database ... 10%
(Reading database ... 15%
(Reading database ... 20%
(Reading database ... 25%
(Reading database ... 30%
(Reading database ... 35%
(Reading database ... 40%
(Reading database ... 45%
(Reading database ... 50%
(Reading database ... 55%
(Reading database ... 60%
(Reading database ... 65%
(Reading database ... 70%
(Reading database ... 75%
(Reading database ... 80%
(Reading database ... 85%
(Reading database ... 90%
(Reading database ... 95%
(Reading database ... 100%
(Reading database ... 20108 files and directories currently installed.)
- Preparing to unpack .../binutils-dev_2.44-3_amd64.deb ...
- Unpacking binutils-dev (2.44-3) ...
- Selecting previously unselected package libboost1.83-dev:amd64.
- Preparing to unpack .../libboost1.83-dev_1.83.0-4.2_amd64.deb ...
- Unpacking libboost1.83-dev:amd64 (1.83.0-4.2) ...
- Selecting previously unselected package libboost-dev:amd64.
- Preparing to unpack .../libboost-dev_1.83.0.2+b2_amd64.deb ...
- Unpacking libboost-dev:amd64 (1.83.0.2+b2) ...
- Setting up libboost1.83-dev:amd64 (1.83.0-4.2) ...
- Setting up binutils-dev (2.44-3) ...
- Setting up libboost-dev:amd64 (1.83.0.2+b2) ...
[clangml.3.7.0.2: dl]
[clangml.3.7.0.2: extract]
[clangml.3.7.0.2/clangml.install: dl]
-> retrieved clangml.3.7.0.2 (https://opam.ocaml.org/cache)
[clangml: make]
+ /usr/bin/make (CWD=/home/opam/.opam/default/.opam-switch/build/clangml.3.7.0.2)
- ocamlbuild -classic-display -cflags -annot clangml.dylib consumer/processor.native -package bytes
- + /home/opam/.opam/default/bin/ocamlc.opt -config
- + /home/opam/.opam/default/bin/ocamlopt.opt unix.cmxa -I /home/opam/.opam/default/lib/ocamlbuild /home/opam/.opam/default/lib/ocamlbuild/ocamlbuildlib.cmxa -I /home/opam/.opam/default/lib/bytes myocamlbuild.ml /home/opam/.opam/default/lib/ocamlbuild/ocamlbuild.cmx -o myocamlbuild
- Fatal error: exception Myocamlbuild.No_command_found("[clang++-3.7; /usr/local/bin/clang++-3.7]")
- + /home/opam/.opam/default/bin/ocamlopt.opt unix.cmxa -I /home/opam/.opam/default/lib/ocamlbuild /home/opam/.opam/default/lib/ocamlbuild/ocamlbuildlib.cmxa -I /home/opam/.opam/default/lib/bytes myocamlbuild.ml /home/opam/.opam/default/lib/ocamlbuild/ocamlbuild.cmx -o myocamlbuild
- File "myocamlbuild.ml", line 193, characters 26-28:
- 193 | "sed 's/\-Wno\-maybe\-uninitialized/\-Wno\-uninitialized/g' |" ^
- ^^
- Warning 14 [illegal-backslash]: illegal backslash escape in string.
- File "myocamlbuild.ml", line 193, characters 31-33:
- 193 | "sed 's/\-Wno\-maybe\-uninitialized/\-Wno\-uninitialized/g' |" ^
- ^^
- Warning 14 [illegal-backslash]: illegal backslash escape in string.
- File "myocamlbuild.ml", line 193, characters 38-40:
- 193 | "sed 's/\-Wno\-maybe\-uninitialized/\-Wno\-uninitialized/g' |" ^
- ^^
- Warning 14 [illegal-backslash]: illegal backslash escape in string.
- File "myocamlbuild.ml", line 193, characters 54-56:
- 193 | "sed 's/\-Wno\-maybe\-uninitialized/\-Wno\-uninitialized/g' |" ^
- ^^
- Warning 14 [illegal-backslash]: illegal backslash escape in string.
- File "myocamlbuild.ml", line 193, characters 59-61:
- 193 | "sed 's/\-Wno\-maybe\-uninitialized/\-Wno\-uninitialized/g' |" ^
- ^^
- Warning 14 [illegal-backslash]: illegal backslash escape in string.
- File "myocamlbuild.ml", line 88, characters 15-31:
- 88 | (match String.lowercase answer with
- ^^^^^^^^^^^^^^^^
- Alert deprecated: Ocamlbuild_plugin.String.lowercase
- Use String.lowercase_ascii/StringLabels.lowercase_ascii instead.
- File "myocamlbuild.ml", line 98, characters 4-16:
- 98 | Scanf.fscanf stdin "%s" (prompt_answer kind)
- ^^^^^^^^^^^^
- Alert deprecated: Stdlib.Scanf.fscanf
- Use Scanning.from_channel then Scanf.bscanf.
- make: *** [Makefile:15: mainClang.native] Error 2
[ERROR] The compilation of clangml.3.7.0.2 failed at "make".
build failed...
=== STDERR ===
2026-09-20 00:40.28: FAILED: build clangml.3.7.0.2
2026-09-20 00:40.28: Job failed: build failed: clangml.3.7.0.2