Build:
  1. 1
  2. 0
2026-09-19 22:52.52: New job: build dssi.0.1.3 (413864a0a331)
2026-09-19 22:52.52: Waiting for resource in pool day11-builds
2026-09-20 00:35.14: Got resource from pool day11-builds
2026-09-20 00:35.14: [profile full] build dssi.0.1.3
2026-09-20 00:35.14: build dssi.0.1.3 (413864a0a331)
=== DEPENDENCIES (14 transitive) ===
  base-threads.base                                  ddcab511c589
  base-unix.base                                     742554e1dbc2
  compiler-cloning.enabled                           9ab6e8146b48
  conf-alsa.1                                        0ff7e926edcc
  conf-dssi.1                                        aef0c9a033eb
  conf-ladspa.1                                      058e404a185b
  conf-pkg-config.5                                  5bc8297bba82
  csexp.1.5.2                                        6dfd0b7165bf
  dune.3.24.2                                        fc1180f13f25
  dune-configurator.3.24.2                           85add40e4d98
  ladspa.0.2.2                                       f56c11f744cf
  ocaml.5.5.1                                        62cb7e73ffb1
  ocaml-base-compiler.5.5.1                          3187d6d6f452
  ocaml-compiler.5.5.1                               3af2e5d33cd9
=== STDOUT ===
Processing: [default: loading data]
[dssi.0.1.3: dl]
[dssi.0.1.3: extract]
-> retrieved dssi.0.1.3  (https://opam.ocaml.org/cache)
[dssi: dune build]
+ /home/opam/.opam/default/bin/dune "build" "-p" "dssi" "-j" "39" "@install" (CWD=/home/opam/.opam/default/.opam-switch/build/dssi.0.1.3)
- File "src/dune", line 12, characters 9-19:
- 12 |   (names dssi_stubs)
-               ^^^^^^^^^^
- (cd _build/default/src && /usr/bin/gcc -O2 -fno-strict-aliasing -fwrapv -fPIC -pthread -D_FILE_OFFSET_BITS=64 -O2 -fno-strict-aliasing -fwrapv -fPIC -pthread -g -I /home/opam/.opam/default/lib/ocaml -I /home/opam/.opam/default/lib/ladspa -o dssi_stubs.o -c dssi_stubs.c)
- dssi_stubs.c: In function 'ocaml_dssi_ladspa':
- dssi_stubs.c:86:10: error: implicit declaration of function 'Val_LADSPA_descr' [-Wimplicit-function-declaration]
-    86 |   return Val_LADSPA_descr(Descr_val(d)->LADSPA_Plugin);
-       |          ^~~~~~~~~~~~~~~~
[ERROR] The compilation of dssi.0.1.3 failed at "dune build -p dssi -j 39 @install".
build failed... 

=== STDERR ===

2026-09-20 00:35.33: FAILED: build dssi.0.1.3
2026-09-20 00:35.33: Job failed: build failed: dssi.0.1.3