Build:
  1. 0
2026-09-19 22:52.52: New job: build metapp.0.4.3 (f06c8ac93f6d)
2026-09-19 22:52.52: Waiting for resource in pool day11-builds
2026-09-20 00:35.21: Got resource from pool day11-builds
2026-09-20 00:35.21: [profile full] build metapp.0.4.3
2026-09-20 00:35.21: build metapp.0.4.3 (f06c8ac93f6d)
=== DEPENDENCIES (18 transitive) ===
  base-threads.base                                  ddcab511c589
  base-unix.base                                     742554e1dbc2
  conf-autoconf.1                                    43fe4a407b7a
  conf-automake.1                                    5b19634b4ea9
  dune.3.24.2                                        6dfe5470779b
  ocaml.4.12.1                                       c1955d2a80c0
  ocaml-base-compiler.4.12.1                         508946109b41
  ocaml-compiler-libs.v0.12.4                        0c7de0714010
  ocaml-config.2                                     1f050df2f239
  ocaml-migrate-parsetree.2.4.0                      daecc2a760b4
  ocaml-secondary-compiler.4.14.2                    e2a22285b593
  ocamlfind.1.9.6                                    d8e3ff7f66c6
  ocamlfind-secondary.1.9.6                          06f018ee18a5
  ppx_derivers.1.2.1                                 1fba1ff38ff5
  ppxlib.0.22.2                                      df80c8225cb9
  sexplib0.v0.16.0                                   cfd5028a156a
  stdcompat.18                                       7a5f3ba17ada
  stdlib-shims.0.3.0                                 f00cc083f9ce
=== STDOUT ===
Processing: [default: loading data]
[metapp.0.4.3: dl]
[metapp.0.4.3: extract]
-> retrieved metapp.0.4.3  (https://opam.ocaml.org/cache)
[metapp: dune build]
+ /home/opam/.opam/default/bin/dune "build" "-p" "metapp" "-j" "39" "@install" (CWD=/home/opam/.opam/default/.opam-switch/build/metapp.0.4.3)
[ERROR] The compilation of metapp.0.4.3 failed at "dune build -p metapp -j 39 @install".
- File "metapp/dune", line 3, characters 14-30:
- 3 |   (preprocess (pps metapp.ppx))
-                   ^^^^^^^^^^^^^^^^
- (cd _build/default && .ppx/e17850eae66b6b5844e45f672bc501f8/ppx.exe --cookie 'library-name="metapp"' -o metapp/metapp.pp.mli --intf metapp/metapp.mli -corrected-suffix .ppx-corrected -diff-cmd - -dump-ast)
- findlib: [WARNING] Interface topdirs.cmi occurs in several directories: /home/opam/.opam/default/lib/ocaml, /home/opam/.opam/default/lib/ocaml/compiler-libs
- File "_none_", line 1:
- Warning 58 [no-cmx-file]: no cmx file was found in path for module Metapp_api, and its interface was not compiled with -opaque
- File "_none_", line 1:
- Error: error loading shared library: Dynlink.Error (Dynlink.Cannot_open_dll "Failure(\"/tmp/build_05048d_dune/metappe16e04.cmxs: failed to map segment from shared object\")")
- File "metapp/dune", line 3, characters 14-30:
- 3 |   (preprocess (pps metapp.ppx))
-                   ^^^^^^^^^^^^^^^^
- (cd _build/default && .ppx/e17850eae66b6b5844e45f672bc501f8/ppx.exe --cookie 'library-name="metapp"' -o metapp/metapp.pp.ml --impl metapp/metapp.ml -corrected-suffix .ppx-corrected -diff-cmd - -dump-ast)
- findlib: [WARNING] Interface topdirs.cmi occurs in several directories: /home/opam/.opam/default/lib/ocaml, /home/opam/.opam/default/lib/ocaml/compiler-libs
- File "_none_", line 1:
- Warning 58 [no-cmx-file]: no cmx file was found in path for module Metapp_api, and its interface was not compiled with -opaque
- File "_none_", line 1:
- Warning 58 [no-cmx-file]: no cmx file was found in path for module Metapp_preutils, and its interface was not compiled with -opaque
- File "_none_", line 1:
- Error: error loading shared library: Dynlink.Error (Dynlink.Cannot_open_dll "Failure(\"/tmp/build_05048d_dune/metapp4aa445.cmxs: failed to map segment from shared object\")")
build failed... 

=== STDERR ===

2026-09-20 00:35.55: FAILED: build metapp.0.4.3
2026-09-20 00:35.55: Job failed: build failed: metapp.0.4.3