Build:
  1. 1
  2. 0
2026-09-19 21:07.30: New job: build metapp.0.4.3 (ca1137c140e3)
2026-09-19 21:07.30: Waiting for resource in pool day11-builds
2026-09-19 23:47.05: Got resource from pool day11-builds
2026-09-19 23:47.05: [profile full] build metapp.0.4.3
2026-09-19 23:47.05: build metapp.0.4.3 (ca1137c140e3)
=== DEPENDENCIES (17 transitive) ===
  base-threads.base                                  ddcab511c589
  base-unix.base                                     742554e1dbc2
  conf-autoconf.1                                    43fe4a407b7a
  conf-automake.1                                    5b19634b4ea9
  dune.3.24.2                                        ad03795b2751
  ocaml.4.13.1                                       2e7ef074d4e9
  ocaml-base-compiler.4.13.1                         1682d9f229ca
  ocaml-compiler-libs.v0.12.4                        3558fdc05ba5
  ocaml-config.2                                     92450e079977
  ocaml-secondary-compiler.4.14.2                    e2a22285b593
  ocamlfind.1.9.6                                    a72cce87301b
  ocamlfind-secondary.1.9.6                          3308995dd421
  ppx_derivers.1.2.1                                 83877103011c
  ppxlib.0.25.1                                      e7a9aa2068ab
  sexplib0.v0.16.0                                   897a36124ef8
  stdcompat.18                                       b7856167fd6c
  stdlib-shims.0.3.0                                 4554b941f15e
=== STDOUT ===
Processing: [default: loading data]
[metapp.0.4.3: dl]
[metapp.0.4.3: extract]
-> retrieved metapp.0.4.3  (https://opam.ocaml.org/cache)
[metapp: dune build]
+ /home/opam/.opam/default/bin/dune "build" "-p" "metapp" "-j" "39" "@install" (CWD=/home/opam/.opam/default/.opam-switch/build/metapp.0.4.3)
- File "metapp/dune", line 3, characters 14-30:
- 3 |   (preprocess (pps metapp.ppx))
-                   ^^^^^^^^^^^^^^^^
- (cd _build/default && .ppx/e17850eae66b6b5844e45f672bc501f8/ppx.exe --cookie 'library-name="metapp"' -o metapp/metapp.pp.mli --intf metapp/metapp.mli -corrected-suffix .ppx-corrected -diff-cmd - -dump-ast)
- findlib: [WARNING] Interface topdirs.cmi occurs in several directories: /home/opam/.opam/default/lib/ocaml, /home/opam/.opam/default/lib/ocaml/compiler-libs
- File "_none_", line 1:
- Warning 58 [no-cmx-file]: no cmx file was found in path for module Metapp_api, and its interface was not compiled with -opaque
- File "_none_", line 1:
- Error: error loading shared library: Dynlink.Error (Dynlink.Cannot_open_dll "Failure(\"/tmp/build_e853e7_dune/metappf66d4c.cmxs: failed to map segment from shared object\")")
- File "metapp/dune", line 3, characters 14-30:
- 3 |   (preprocess (pps metapp.ppx))
-                   ^^^^^^^^^^^^^^^^
- (cd _build/default && .ppx/e17850eae66b6b5844e45f672bc501f8/ppx.exe --cookie 'library-name="metapp"' -o metapp/metapp.pp.ml --impl metapp/metapp.ml -corrected-suffix .ppx-corrected -diff-cmd - -dump-ast)
- findlib: [WARNING] Interface topdirs.cmi occurs in several directories: /home/opam/.opam/default/lib/ocaml, /home/opam/.opam/default/lib/ocaml/compiler-libs
- File "_none_", line 1:
- Warning 58 [no-cmx-file]: no cmx file was found in path for module Metapp_api, and its interface was not compiled with -opaque
- File "_none_", line 1:
- Warning 58 [no-cmx-file]: no cmx file was found in path for module Metapp_preutils, and its interface was not compiled with -opaque
- File "_none_", line 1:
- Error: error loading shared library: Dynlink.Error (Dynlink.Cannot_open_dll "Failure(\"/tmp/build_e853e7_dune/metapp83d922.cmxs: failed to map segment from shared object\")")
[ERROR] The compilation of metapp.0.4.3 failed at "dune build -p metapp -j 39 @install".
build failed... 

=== STDERR ===

2026-09-19 23:47.42: FAILED: build metapp.0.4.3
2026-09-19 23:47.42: Job failed: build failed: metapp.0.4.3