Build:
- 0
2026-09-19 20:23.31: New job: build metapp.0.4.4 (7b5f151e8e6a)
2026-09-19 20:23.31: Waiting for resource in pool day11-builds
2026-09-19 22:39.10: Got resource from pool day11-builds
2026-09-19 22:39.10: [profile full] build metapp.0.4.4
2026-09-19 22:39.10: build metapp.0.4.4 (7b5f151e8e6a)
=== DEPENDENCIES (14 transitive) ===
base-threads.base ddcab511c589
base-unix.base 742554e1dbc2
dune.3.24.2 257948466020
ocaml.5.3.0 55734ab946ce
ocaml-base-compiler.5.3.0 82e869b248a7
ocaml-compiler.5.3.0 da258b07979d
ocaml-compiler-libs.v0.17.0 e102d6248307
ocaml-config.3 8839a7892a4d
ocamlfind.1.9.8 0cf2f5e2b174
ppx_derivers.1.2.1 32a69341acfd
ppxlib.0.35.0 8e0a3d070ded
sexplib0.v0.17.0 666aea651c23
stdcompat.21.1 8e9491d5b816
stdlib-shims.0.3.0 335533c08cc7
=== STDOUT ===
Processing: [default: loading data]
[metapp.0.4.4: dl]
[metapp.0.4.4: extract]
-> retrieved metapp.0.4.4 (https://opam.ocaml.org/cache)
[metapp: dune build]
+ /home/opam/.opam/default/bin/dune "build" "-p" "metapp" "-j" "39" "@install" (CWD=/home/opam/.opam/default/.opam-switch/build/metapp.0.4.4)
- (cd _build/default && .ppx/e17850eae66b6b5844e45f672bc501f8/ppx.exe --cookie 'library-name="metapp"' -o metapp/metapp.pp.mli --intf metapp/metapp.mli -corrected-suffix .ppx-corrected -diff-cmd - -dump-ast)
- File "_none_", line 1:
- Warning 58 [no-cmx-file]: no cmx file was found in path for module Metapp_api, and its interface was not compiled with -opaque
-
- File "_none_", line 1:
- Warning 58 [no-cmx-file]: no cmx file was found in path for module Metapp_version_info, and its interface was not compiled with -opaque
- File "_none_", line 1:
- Error: error loading shared library: Failure("/tmp/build_a4c8f0_dune/metapp2f8902.cmxs: failed to map segment from shared object")
- (cd _build/default && .ppx/e17850eae66b6b5844e45f672bc501f8/ppx.exe --cookie 'library-name="metapp"' -o metapp/metapp.pp.ml --impl metapp/metapp.ml -corrected-suffix .ppx-corrected -diff-cmd - -dump-ast)
- File "_none_", line 1:
- Warning 58 [no-cmx-file]: no cmx file was found in path for module Metapp_api, and its interface was not compiled with -opaque
-
- File "_none_", line 1:
- Warning 58 [no-cmx-file]: no cmx file was found in path for module Metapp_preutils, and its interface was not compiled with -opaque
-
- File "_none_", line 1:
- Warning 58 [no-cmx-file]: no cmx file was found in path for module Metapp_version_info, and its interface was not compiled with -opaque
- File "_none_", line 1:
- Error: error loading shared library: Failure("/tmp/build_a4c8f0_dune/metappe77e28.cmxs: failed to map segment from shared object")
[ERROR] The compilation of metapp.0.4.4 failed at "dune build -p metapp -j 39 @install".
build failed...
=== STDERR ===
2026-09-19 22:39.44: FAILED: build metapp.0.4.4
2026-09-19 22:39.44: Job failed: build failed: metapp.0.4.4