Build:
- 0
2026-09-19 20:12.00: New job: build fdkaac.0.3.2 (c6ef88c47ae2) 2026-09-19 20:12.00: Waiting for resource in pool day11-builds 2026-09-19 21:21.20: Got resource from pool day11-builds 2026-09-19 21:21.20: [profile full] build fdkaac.0.3.2 2026-09-19 21:21.20: build fdkaac.0.3.2 (c6ef88c47ae2) === DEPENDENCIES (9 transitive) === base-threads.base ddcab511c589 base-unix.base 742554e1dbc2 compiler-cloning.enabled 9ab6e8146b48 csexp.1.5.2 6dfd0b7165bf dune.3.24.2 fc1180f13f25 dune-configurator.3.24.2 85add40e4d98 ocaml.5.5.1 62cb7e73ffb1 ocaml-base-compiler.5.5.1 3187d6d6f452 ocaml-compiler.5.5.1 3af2e5d33cd9 === STDOUT === Processing: [default: loading data] [WARNING] These additional system packages are required, but not available on your system: libfdk-aac-dev [fdkaac.0.3.2: dl] [fdkaac.0.3.2: extract] -> retrieved fdkaac.0.3.2 (https://opam.ocaml.org/cache) [fdkaac: dune build] + /home/opam/.opam/default/bin/dune "build" "-p" "fdkaac" "-j" "39" "@install" (CWD=/home/opam/.opam/default/.opam-switch/build/fdkaac.0.3.2) - File "src/dune", line 7, characters 9-21: - 7 | (names fdkaac_stubs) - ^^^^^^^^^^^^ - (cd _build/default/src && /usr/bin/gcc -O2 -fno-strict-aliasing -fwrapv -fPIC -pthread -D_FILE_OFFSET_BITS=64 -g -I /home/opam/.opam/default/lib/ocaml -o fdkaac_stubs.o -c fdkaac_stubs.c) - fdkaac_stubs.c:33:10: fatal error: fdk-aac/aacenc_lib.h: No such file or directory - 33 | #include <fdk-aac/aacenc_lib.h> - | ^~~~~~~~~~~~~~~~~~~~~~ - compilation terminated. [ERROR] The compilation of fdkaac.0.3.2 failed at "dune build -p fdkaac -j 39 @install". build failed... === STDERR === 2026-09-19 21:21.25: FAILED: build fdkaac.0.3.2 2026-09-19 21:21.25: Job failed: build failed: fdkaac.0.3.2