Build:
  1. 0
2026-09-19 20:12.00: New job: build lo.0.2.0 (48d59c00f237)
2026-09-19 20:12.00: Waiting for resource in pool day11-builds
2026-09-19 21:21.34: Got resource from pool day11-builds
2026-09-19 21:21.34: [profile full] build lo.0.2.0
2026-09-19 21:21.34: build lo.0.2.0 (48d59c00f237)
=== DEPENDENCIES (10 transitive) ===
  base-threads.base                                  ddcab511c589
  base-unix.base                                     742554e1dbc2
  compiler-cloning.enabled                           9ab6e8146b48
  conf-liblo.1                                       baa5dd1133fe
  csexp.1.5.2                                        6dfd0b7165bf
  dune.3.24.2                                        fc1180f13f25
  dune-configurator.3.24.2                           85add40e4d98
  ocaml.5.5.1                                        62cb7e73ffb1
  ocaml-base-compiler.5.5.1                          3187d6d6f452
  ocaml-compiler.5.5.1                               3af2e5d33cd9
=== STDOUT ===
Processing: [default: loading data]
[lo.0.2.0: dl]
[lo.0.2.0: extract]
-> retrieved lo.0.2.0  (https://opam.ocaml.org/cache)
[lo: dune build]
+ /home/opam/.opam/default/bin/dune "build" "-p" "lo" "-j" "39" "@install" (CWD=/home/opam/.opam/default/.opam-switch/build/lo.0.2.0)
- File "src/dune", line 9, characters 9-17:
- 9 |   (names lo_stubs)
-              ^^^^^^^^
- (cd _build/default/src && /usr/bin/gcc -O2 -fno-strict-aliasing -fwrapv -fPIC -pthread -D_FILE_OFFSET_BITS=64 -g -I /home/opam/.opam/default/lib/ocaml -I /home/opam/.opam/default/lib/ocaml/threads -I /home/opam/.opam/default/lib/ocaml/unix -o lo_stubs.o -c lo_stubs.c)
- lo_stubs.c: In function 'caml_lo_message_new':
- lo_stubs.c:70:20: error: assignment to 'lo_address' {aka 'struct lo_address_ *'} from incompatible pointer type 'lo_message' {aka 'struct lo_message_ *'} [-Wincompatible-pointer-types]
-    70 |   Address_val(ans) = m;
-       |                    ^
build failed... 
[ERROR] The compilation of lo.0.2.0 failed at "dune build -p lo -j 39 @install".

=== STDERR ===

2026-09-19 21:22.19: FAILED: build lo.0.2.0
2026-09-19 21:22.19: Job failed: build failed: lo.0.2.0