Build:
- 0
2026-09-19 19:03.13: New job: build conjury.2.1.1 (b37c181dd7f7) 2026-09-19 19:03.13: Waiting for resource in pool day11-builds 2026-09-19 20:48.44: Got resource from pool day11-builds 2026-09-19 20:48.44: [profile full] build conjury.2.1.1 2026-09-19 20:48.44: build conjury.2.1.1 (b37c181dd7f7) === DEPENDENCIES (11 transitive) === base-threads.base ddcab511c589 base-unix.base 742554e1dbc2 dune.3.24.2 ea2bcb45ca29 ocaml.4.14.4 0eceb429ac11 ocaml-base-compiler.4.14.4 4a21df12bcb6 ocaml-config.2 58cec4e89336 ocamlfind.1.9.8 7bca84f6ccc0 omake.0.10.7 1af3e207ea9f ounit2.2.2.7 e1137ca3f11d seq.base 5c9e32a94f22 stdlib-shims.0.3.0 f92f058899fa === STDOUT === Processing: [default: loading data] [conjury.2.1.1: dl] [conjury.2.1.1: extract] -> retrieved conjury.2.1.1 (https://opam.ocaml.org/cache) [conjury: omake build] + /home/opam/.opam/default/bin/omake "--dotomake.omake" "--force-dotomake" "--configure" "build" (CWD=/home/opam/.opam/default/.opam-switch/build/conjury.2.1.1) - *** omake: reading OMakefiles - *** omake: finished reading OMakefiles (0.05 sec) - *** omake: done (0.05 sec, 0/0 scans, 0/0 rules, 11/45 digests) -> compiled conjury.2.1.1 [conjury: omake install] + /home/opam/.opam/default/bin/omake "--dotomake.omake" "--force-dotomake" "install" (CWD=/home/opam/.opam/default/.opam-switch/build/conjury.2.1.1) - *** omake: reading OMakefiles - *** omake error: - File Conjury/Basis/Exceptions.om: line 59, characters 8-21 - Uncaught Exception: - External requirement: Header <stddef.h> not available! [ERROR] The installation of conjury failed at "omake --dotomake.omake --force-dotomake install". install failed... === STDERR === 2026-09-19 20:48.53: FAILED: build conjury.2.1.1 2026-09-19 20:48.53: Job failed: build failed: conjury.2.1.1