Build:
  1. 0
2026-09-19 18:58.01: New job: build metapp.0.4.4 (bae6daaa5fbb)
2026-09-19 18:58.01: Waiting for resource in pool day11-builds
2026-09-19 20:38.58: Got resource from pool day11-builds
2026-09-19 20:38.58: [profile full] build metapp.0.4.4
2026-09-19 20:38.58: build metapp.0.4.4 (bae6daaa5fbb)
=== DEPENDENCIES (13 transitive) ===
  base-threads.base                                  ddcab511c589
  base-unix.base                                     742554e1dbc2
  dune.3.24.2                                        85feefa88647
  ocaml.5.2.1                                        b42e4e1b7a7f
  ocaml-base-compiler.5.2.1                          a46ae1516fce
  ocaml-compiler-libs.v0.17.0                        d9e7add20771
  ocaml-config.3                                     e93b3fcbaf51
  ocamlfind.1.9.8                                    7420d4eef490
  ppx_derivers.1.2.1                                 338da8dbbe99
  ppxlib.0.35.0                                      62ab2230a2fb
  sexplib0.v0.17.0                                   3216f22591e6
  stdcompat.21.1                                     ea6c50c2b982
  stdlib-shims.0.3.0                                 550da1706c31
=== STDOUT ===
Processing: [default: loading data]
[metapp.0.4.4: dl]
[metapp.0.4.4: extract]
-> retrieved metapp.0.4.4  (https://opam.ocaml.org/cache)
[metapp: dune build]
+ /home/opam/.opam/default/bin/dune "build" "-p" "metapp" "-j" "39" "@install" (CWD=/home/opam/.opam/default/.opam-switch/build/metapp.0.4.4)
- (cd _build/default && .ppx/e17850eae66b6b5844e45f672bc501f8/ppx.exe --cookie 'library-name="metapp"' -o metapp/metapp.pp.mli --intf metapp/metapp.mli -corrected-suffix .ppx-corrected -diff-cmd - -dump-ast)
- File "_none_", line 1:
- Warning 58 [no-cmx-file]: no cmx file was found in path for module Metapp_api, and its interface was not compiled with -opaque
- 
- File "_none_", line 1:
- Warning 58 [no-cmx-file]: no cmx file was found in path for module Metapp_version_info, and its interface was not compiled with -opaque
- File "_none_", line 1:
- Error: error loading shared library: Failure("/tmp/build_adcf99_dune/metapp6e007a.cmxs: failed to map segment from shared object")
- (cd _build/default && .ppx/e17850eae66b6b5844e45f672bc501f8/ppx.exe --cookie 'library-name="metapp"' -o metapp/metapp.pp.ml --impl metapp/metapp.ml -corrected-suffix .ppx-corrected -diff-cmd - -dump-ast)
- File "_none_", line 1:
- Warning 58 [no-cmx-file]: no cmx file was found in path for module Metapp_api, and its interface was not compiled with -opaque
- 
- File "_none_", line 1:
- Warning 58 [no-cmx-file]: no cmx file was found in path for module Metapp_preutils, and its interface was not compiled with -opaque
- 
- File "_none_", line 1:
- Warning 58 [no-cmx-file]: no cmx file was found in path for module Metapp_version_info, and its interface was not compiled with -opaque
- File "_none_", line 1:
- Error: error loading shared library: Failure("/tmp/build_adcf99_dune/metappcca25a.cmxs: failed to map segment from shared object")
[ERROR] The compilation of metapp.0.4.4 failed at "dune build -p metapp -j 39 @install".
build failed... 

=== STDERR ===

2026-09-19 20:39.12: FAILED: build metapp.0.4.4
2026-09-19 20:39.17: Job failed: build failed: metapp.0.4.4