Build:
  1. 0
2026-09-19 18:46.16: New job: build metapp.0.4.4 (e9bf88b55c24)
2026-09-19 18:46.16: Waiting for resource in pool day11-builds
2026-09-19 20:34.32: Got resource from pool day11-builds
2026-09-19 20:34.32: [profile full] build metapp.0.4.4
2026-09-19 20:34.32: build metapp.0.4.4 (e9bf88b55c24)
=== DEPENDENCIES (14 transitive) ===
  base-threads.base                                  ddcab511c589
  base-unix.base                                     742554e1dbc2
  conf-autoconf.1                                    43fe4a407b7a
  dune.3.24.2                                        5923405810fc
  ocaml.5.0.0                                        8d11afc53104
  ocaml-base-compiler.5.0.0                          bae3367493d6
  ocaml-compiler-libs.v0.12.4                        724ad2eaed88
  ocaml-config.3                                     773982463adc
  ocamlfind.1.9.8                                    36f8148f945d
  ppx_derivers.1.2.1                                 5e8eb0f244d4
  ppxlib.0.35.0                                      e050c1e11eae
  sexplib0.v0.17.0                                   cb4e8364165e
  stdcompat.20.1                                     cd3da9dc8a28
  stdlib-shims.0.3.0                                 f9bc7e1961de
=== STDOUT ===
Processing: [default: loading data]
[metapp.0.4.4: dl]
[metapp.0.4.4: extract]
-> retrieved metapp.0.4.4  (https://opam.ocaml.org/cache)
[metapp: dune build]
+ /home/opam/.opam/default/bin/dune "build" "-p" "metapp" "-j" "39" "@install" (CWD=/home/opam/.opam/default/.opam-switch/build/metapp.0.4.4)
- (cd _build/default && .ppx/e17850eae66b6b5844e45f672bc501f8/ppx.exe --cookie 'library-name="metapp"' -o metapp/metapp.pp.ml --impl metapp/metapp.ml -corrected-suffix .ppx-corrected -diff-cmd - -dump-ast)
- File "_none_", line 1:
- Warning 58 [no-cmx-file]: no cmx file was found in path for module Metapp_api, and its interface was not compiled with -opaque
- File "_none_", line 1:
- Warning 58 [no-cmx-file]: no cmx file was found in path for module Metapp_preutils, and its interface was not compiled with -opaque
- File "_none_", line 1:
- Warning 58 [no-cmx-file]: no cmx file was found in path for module Metapp_version_info, and its interface was not compiled with -opaque
- File "_none_", line 1:
- Error: error loading shared library: Dynlink.Error (Dynlink.Cannot_open_dll "Failure(\"/tmp/build_8b8860_dune/metapp5a8786.cmxs: failed to map segment from shared object\")")
- (cd _build/default && .ppx/e17850eae66b6b5844e45f672bc501f8/ppx.exe --cookie 'library-name="metapp"' -o metapp/metapp.pp.mli --intf metapp/metapp.mli -corrected-suffix .ppx-corrected -diff-cmd - -dump-ast)
- File "_none_", line 1:
- Warning 58 [no-cmx-file]: no cmx file was found in path for module Metapp_api, and its interface was not compiled with -opaque
- File "_none_", line 1:
- Warning 58 [no-cmx-file]: no cmx file was found in path for module Metapp_version_info, and its interface was not compiled with -opaque
- File "_none_", line 1:
- Error: error loading shared library: Dynlink.Error (Dynlink.Cannot_open_dll "Failure(\"/tmp/build_8b8860_dune/metapp996ba1.cmxs: failed to map segment from shared object\")")
[ERROR] The compilation of metapp.0.4.4 failed at "dune build -p metapp -j 39 @install".
build failed... 

=== STDERR ===

2026-09-19 20:35.41: FAILED: build metapp.0.4.4
2026-09-19 20:35.41: Job failed: build failed: metapp.0.4.4