Build:
  1. 0
2026-09-19 18:40.30: New job: build metapp.0.4.4 (5785372c3ff2)
2026-09-19 18:40.30: Waiting for resource in pool day11-builds
2026-09-19 20:28.11: Got resource from pool day11-builds
2026-09-19 20:28.11: [profile full] build metapp.0.4.4
2026-09-19 20:28.11: build metapp.0.4.4 (5785372c3ff2)
=== DEPENDENCIES (13 transitive) ===
  base-threads.base                                  ddcab511c589
  base-unix.base                                     742554e1dbc2
  dune.3.24.2                                        dc3f9ebeb2c5
  ocaml.5.1.1                                        c9e198b623eb
  ocaml-base-compiler.5.1.1                          5cf19152a1ee
  ocaml-compiler-libs.v0.12.4                        99edfc2f9a6c
  ocaml-config.3                                     e6b2ec5fd199
  ocamlfind.1.9.8                                    ea69af16cd4c
  ppx_derivers.1.2.1                                 fda61103f5f6
  ppxlib.0.35.0                                      214a86a23db7
  sexplib0.v0.17.0                                   77a0c85fbcce
  stdcompat.21.1                                     a9f65d0baf2f
  stdlib-shims.0.3.0                                 7954f0edd45c
=== STDOUT ===
Processing: [default: loading data]
[metapp.0.4.4: dl]
[metapp.0.4.4: extract]
-> retrieved metapp.0.4.4  (https://opam.ocaml.org/cache)
[metapp: dune build]
+ /home/opam/.opam/default/bin/dune "build" "-p" "metapp" "-j" "39" "@install" (CWD=/home/opam/.opam/default/.opam-switch/build/metapp.0.4.4)
- (cd _build/default && .ppx/e17850eae66b6b5844e45f672bc501f8/ppx.exe --cookie 'library-name="metapp"' -o metapp/metapp.pp.mli --intf metapp/metapp.mli -corrected-suffix .ppx-corrected -diff-cmd - -dump-ast)
- File "_none_", line 1:
- Warning 58 [no-cmx-file]: no cmx file was found in path for module Metapp_api, and its interface was not compiled with -opaque
- 
- File "_none_", line 1:
- Warning 58 [no-cmx-file]: no cmx file was found in path for module Metapp_version_info, and its interface was not compiled with -opaque
- File "_none_", line 1:
- Error: error loading shared library: Dynlink.Error (Dynlink.Cannot_open_dll "Failure(\"/tmp/build_538d83_dune/metapp0696f1.cmxs: failed to map segment from shared object\")")
- (cd _build/default && .ppx/e17850eae66b6b5844e45f672bc501f8/ppx.exe --cookie 'library-name="metapp"' -o metapp/metapp.pp.ml --impl metapp/metapp.ml -corrected-suffix .ppx-corrected -diff-cmd - -dump-ast)
- File "_none_", line 1:
- Warning 58 [no-cmx-file]: no cmx file was found in path for module Metapp_api, and its interface was not compiled with -opaque
- 
- File "_none_", line 1:
- Warning 58 [no-cmx-file]: no cmx file was found in path for module Metapp_preutils, and its interface was not compiled with -opaque
- 
- File "_none_", line 1:
- Warning 58 [no-cmx-file]: no cmx file was found in path for module Metapp_version_info, and its interface was not compiled with -opaque
- File "_none_", line 1:
- Error: error loading shared library: Dynlink.Error (Dynlink.Cannot_open_dll "Failure(\"/tmp/build_538d83_dune/metapp870a90.cmxs: failed to map segment from shared object\")")
[ERROR] The compilation of metapp.0.4.4 failed at "dune build -p metapp -j 39 @install".
build failed... 

=== STDERR ===

2026-09-19 20:28.37: FAILED: build metapp.0.4.4
2026-09-19 20:28.37: Job failed: build failed: metapp.0.4.4