Build:
- 0
2026-09-19 17:48.40: New job: build oclock.0.3.0 (898c1a58f035) 2026-09-19 17:48.40: Waiting for resource in pool day11-builds 2026-09-19 18:12.55: Got resource from pool day11-builds 2026-09-19 18:12.55: [profile full] build oclock.0.3.0 2026-09-19 18:12.55: build oclock.0.3.0 (898c1a58f035) === DEPENDENCIES (5 transitive) === compiler-cloning.enabled 9ab6e8146b48 ocaml.5.5.1 62cb7e73ffb1 ocaml-base-compiler.5.5.1 3187d6d6f452 ocaml-compiler.5.5.1 3af2e5d33cd9 ocamlfind.1.9.9~preview 7593ab790e0d === STDOUT === Processing: [default: loading data] [oclock.0.3.0: dl] [oclock.0.3.0: extract] -> retrieved oclock.0.3.0 (https://opam.ocaml.org/cache) [oclock: make] + /usr/bin/make "CFLAGS=-I /home/opam/.opam/default/lib/ocaml -fPIC" (CWD=/home/opam/.opam/default/.opam-switch/build/oclock.0.3.0) - ocamldep *.ml *.mli > .depend - ocamlc -c oclock.mli - ocamlc -c oclock.ml - cc -I /home/opam/.opam/default/lib/ocaml -fPIC -c -o oclock_stubs.o oclock_stubs.c - oclock_stubs.c: In function 'oclock_getres': - oclock_stubs.c:65:9: error: implicit declaration of function 'copy_int64'; did you mean 'caml_copy_int64'? [-Wimplicit-function-declaration] - 65 | res = copy_int64(ts.tv_sec * 1000000000LL + ts.tv_nsec); - | ^~~~~~~~~~ - | caml_copy_int64 - make: *** [<builtin>: oclock_stubs.o] Error 1 [ERROR] The compilation of oclock.0.3.0 failed at "make CFLAGS=-I /home/opam/.opam/default/lib/ocaml -fPIC". build failed... === STDERR === 2026-09-19 18:13.14: FAILED: build oclock.0.3.0 2026-09-19 18:13.14: Job failed: build failed: oclock.0.3.0