Build:
  1. 0
2026-09-19 17:48.40: New job: build termbox.0.1.0 (10bb5e636a34)
2026-09-19 17:48.40: Waiting for resource in pool day11-builds
2026-09-19 18:12.46: Got resource from pool day11-builds
2026-09-19 18:12.46: [profile full] build termbox.0.1.0
2026-09-19 18:12.46: build termbox.0.1.0 (10bb5e636a34)
=== DEPENDENCIES (5 transitive) ===
  compiler-cloning.enabled                           9ab6e8146b48
  ocaml.5.5.1                                        62cb7e73ffb1
  ocaml-base-compiler.5.5.1                          3187d6d6f452
  ocaml-compiler.5.5.1                               3af2e5d33cd9
  ocamlfind.1.9.9~preview                            7593ab790e0d
=== STDOUT ===
Processing: [default: loading data]
[WARNING] These additional system packages are required, but not available on your system: python
[termbox.0.1.0: dl]
[termbox.0.1.0: extract]
-> retrieved termbox.0.1.0  (https://opam.ocaml.org/cache)
[termbox: make]
+ /usr/bin/make  (CWD=/home/opam/.opam/default/.opam-switch/build/termbox.0.1.0)
- cd termbox && ./waf configure && ./waf
- env: 'python': No such file or directory
- make: *** [Makefile:26: termbox/build/src/libtermbox.a] Error 127
[ERROR] The compilation of termbox.0.1.0 failed at "make".
build failed... 

=== STDERR ===

2026-09-19 18:12.55: FAILED: build termbox.0.1.0
2026-09-19 18:12.55: Job failed: build failed: termbox.0.1.0