Build:
  1. 0
2026-09-19 17:40.31: New job: build tuareg.2.0.10 (e3aad76e2702)
2026-09-19 17:40.31: Waiting for resource in pool day11-builds
2026-09-19 17:48.59: Got resource from pool day11-builds
2026-09-19 17:48.59: [profile full] build tuareg.2.0.10
2026-09-19 17:48.59: build tuareg.2.0.10 (e3aad76e2702)
=== DEPENDENCIES (5 transitive) ===
  compiler-cloning.enabled                           9ab6e8146b48
  conf-emacs.1                                       8e0238e839ae
  ocaml.5.5.1                                        62cb7e73ffb1
  ocaml-base-compiler.5.5.1                          3187d6d6f452
  ocaml-compiler.5.5.1                               3af2e5d33cd9
=== STDOUT ===
Processing: [default: loading data]
[tuareg.2.0.10: dl]
[tuareg.2.0.10: extract]
[tuareg.2.0.10/0001-Run-opam-sexp-rather-than-parse-its-shell-output.patch: dl]
-> retrieved tuareg.2.0.10  (https://opam.ocaml.org/cache)
[tuareg: patch] applying 0001-Run-opam-sexp-rather-than-parse-its-shell-output.patch
[tuareg: make tuareg-site-file.el]
+ /usr/bin/make "tuareg-site-file.el" (CWD=/home/opam/.opam/default/.opam-switch/build/tuareg.2.0.10)
- (echo ";;; tuareg-site-file.el --- Automatically extracted autoloads.";\
-  echo ";;; Code:";\
-  echo "(add-to-list 'load-path";\
-  echo "             (or (file-name-directory load-file-name) (car load-path)))";\
-  echo "") >tuareg-site-file.el
- emacs --batch --eval '(setq generated-autoload-file "'`pwd`'/tuareg-site-file.el")' -f batch-update-autoloads "."
- Loading /etc/emacs/site-start.d/00debian.el (source)...
- Symbol's function definition is void: batch-update-autoloads
- 
- Error: void-function (batch-update-autoloads)
-   batch-update-autoloads()
-   command-line-1(("--eval" "(setq generated-autoload-file \"/home/opam/.opam/default/.opam-switch/build/tuareg.2.0.10/tuareg-site-file.el\")" "-f" "batch-update-autoloads" "."))
-   command-line()
-   normal-top-level()
- make: *** [Makefile:83: tuareg-site-file.el] Error 255
[ERROR] The compilation of tuareg.2.0.10 failed at "make tuareg-site-file.el".
build failed... 

=== STDERR ===

2026-09-19 17:49.28: FAILED: build tuareg.2.0.10
2026-09-19 17:49.28: Job failed: build failed: tuareg.2.0.10