Build:
  1. 0
2026-09-19 17:40.31: New job: build conf-cuda.1 (5837df26dbe0)
2026-09-19 17:40.31: Waiting for resource in pool day11-builds
2026-09-19 17:49.07: Got resource from pool day11-builds
2026-09-19 17:49.07: [profile full] build conf-cuda.1
2026-09-19 17:49.07: build conf-cuda.1 (5837df26dbe0)
=== DEPENDENCIES (5 transitive) ===
  compiler-cloning.enabled                           9ab6e8146b48
  conf-cuda-config.1                                 032ebbc4bce7
  ocaml.5.5.1                                        62cb7e73ffb1
  ocaml-base-compiler.5.5.1                          3187d6d6f452
  ocaml-compiler.5.5.1                               3af2e5d33cd9
=== STDOUT ===
Processing: [default: loading data]
[conf-cuda: sh cat <<EOF > test.c
   #include  "cuda.h"
   #include  "nvrtc.h"
   ]
+ /usr/bin/sh "-exc" "cat <<EOF > test.c\n   #include  \"cuda.h\"\n   #include  \"nvrtc.h\"\n   " (CWD=/home/opam/.opam/default/.opam-switch/build/conf-cuda.1)
- + cat
[conf-cuda: sh]
+ /usr/bin/sh "-exc" "$(ocamlc -config-var c_compiler) -c $CFLAGS -I'/usr/local/cuda/include' test.c" (CWD=/home/opam/.opam/default/.opam-switch/build/conf-cuda.1)
- + ocamlc -config-var c_compiler
- + gcc -c -I/usr/local/cuda/include test.c
- test.c:1:14: fatal error: cuda.h: No such file or directory
-     1 |    #include  "cuda.h"
-       |              ^~~~~~~~
- compilation terminated.
[ERROR] The compilation of conf-cuda.1 failed at "sh -exc $(ocamlc -config-var c_compiler) -c $CFLAGS -I'/usr/local/cuda/include' test.c".
build failed... 

=== STDERR ===

2026-09-19 17:49.31: FAILED: build conf-cuda.1
2026-09-19 17:49.31: Job failed: build failed: conf-cuda.1