Build:
  1. 0
2026-09-19 16:55.33: New job: build conf-opencc0.1 (6d97c7433ec2)
2026-09-19 16:55.33: Waiting for resource in pool day11-builds
2026-09-19 17:01.58: Got resource from pool day11-builds
2026-09-19 17:01.58: [profile full] build conf-opencc0.1
2026-09-19 17:01.58: build conf-opencc0.1 (6d97c7433ec2)
=== DEPENDENCIES (0 transitive) ===

=== STDOUT ===
Processing: [default: loading data]
[WARNING] These additional system packages are required, but not available on your system: libopencc1
[conf-opencc0.1/test.c: dl]
-> retrieved conf-opencc0.1  (https://opam.ocaml.org/cache)
[conf-opencc0: sh cc $CFLAGS test.c -l:libopencc.so.1]
+ /usr/bin/sh "-exec" "cc $CFLAGS test.c -l:libopencc.so.1" (CWD=/home/opam/.opam/default/.opam-switch/build/conf-opencc0.1)
- + cc test.c -l:libopencc.so.1
- /usr/bin/ld: cannot find -l:libopencc.so.1: No such file or directory
- collect2: error: ld returned 1 exit status
[ERROR] The compilation of conf-opencc0.1 failed at "sh -exec cc $CFLAGS test.c -l:libopencc.so.1".
build failed... 

=== STDERR ===

2026-09-19 17:03.57: FAILED: build conf-opencc0.1
2026-09-19 17:03.57: Job failed: build failed: conf-opencc0.1