Build:
- 0
2026-08-25 20:08.03: New job: build inquire.0.3.1 (90608c3621a0)
2026-08-25 20:08.03: Waiting for resource in pool day11-builds
2026-08-25 21:11.33: Got resource from pool day11-builds
2026-08-25 21:11.33: [profile full] build inquire.0.3.1
2026-08-25 21:11.33: build inquire.0.3.1 (90608c3621a0)
=== DEPENDENCIES (11 transitive) ===
base-threads.base 3d2f2cbc6db2
base-unix.base 3a38ddca6b5e
compiler-cloning.enabled 966a2e6839f0
dune.3.24.2 ec704e062ad3
ocaml.5.5.0 22ebd7932512
ocaml-base-compiler.5.5.0 db1659234e8a
ocaml-compiler.5.5.0 7f52fb26d939
ocamlbuild.0.16.1 ccce18256717
ocamlfind.1.9.9~preview 6a4c70487cf9
topkg.1.1.1 3bd227743fbd
uutf.1.0.4 af704224ff27
=== STDOUT ===
Processing: [default: loading data]
[inquire.0.3.1: dl]
[inquire.0.3.1: extract]
-> retrieved inquire.0.3.1 (https://opam.ocaml.org/cache)
[inquire: dune build]
+ /home/opam/.opam/default/bin/dune "build" "-p" "inquire" "-j" "39" "@install" (CWD=/home/opam/.opam/default/.opam-switch/build/inquire.0.3.1)
- File "vendor/ocaml-ansi/src/dune", line 7, characters 9-19:
- 7 | (names ansi_stubs))
- ^^^^^^^^^^
- (cd _build/default/vendor/ocaml-ansi/src && /usr/bin/gcc -O2 -fno-strict-aliasing -fwrapv -fPIC -pthread -D_FILE_OFFSET_BITS=64 -O2 -fno-strict-aliasing -fwrapv -fPIC -pthread -g -I /home/opam/.opam/default/lib/ocaml -I /home/opam/.opam/default/lib/bytes -I /home/opam/.opam/default/lib/ocaml/unix -o ansi_stubs.o -c ansi_stubs.c)
- ansi_stubs.c: In function 'Ansi_term_size':
- ansi_stubs.c:45:36: error: implicit declaration of function 'failwith'; did you mean 'caml_failwith'? [-Wimplicit-function-declaration]
- 45 | if (ioctl(fd, TIOCGWINSZ, &win)) failwith("Ansi.size");
- | ^~~~~~~~
- | caml_failwith
[ERROR] The compilation of inquire.0.3.1 failed at "dune build -p inquire -j 39 @install".
build failed...
=== STDERR ===
2026-08-25 21:11.46: FAILED: build inquire.0.3.1
2026-08-25 21:11.46: Job failed: build failed: inquire.0.3.1